PWH SERVICES

FAILURE: Build failed with an exception Exception: Gradle task assembleDebug failed with exit code 1

FAILURE: Build failed with an exception Exception: Gradle task assembleDebug failed with exit code 1

Uh-oh! Your app’s having a moment, and it’s all like, “FAILURE: Build failed with an exception Exception: Gradle task assembleDebug failed with exit code 1.” Sounds like tech talk, right? Don’t panic! Let’s break it down : Note : For video solution you can check our video guide here – PWH SERVICES YOUTUBE 🕵️ Detective

FAILURE: Build failed with an exception Exception: Gradle task assembleDebug failed with exit code 1 Read More »

Software Development

Software Development in a Post-Pandemic World

The COVID-19 pandemic has left an indelible mark on various aspects of our lives, and the realm of software development is no exception. As businesses adapted to remote work and digital transformation accelerated at an unprecedented pace, the software development landscape witnessed significant shifts. As we navigate the post-pandemic world, it’s crucial to understand how

Software Development in a Post-Pandemic World Read More »

Blog 1

Software Development: A Beginner’s Guide to Navigating the Digital Frontier

Welcome to the “Beginner’s Guide to Navigating the Digital Frontier” In this era of rapid technological advancement, it’s undeniable that software development stands as the driving force propelling digital innovation forward. From the intuitive applications residing on our smartphones to the intricately woven systems that power global enterprises, software undeniably serves as the foundational bedrock

Software Development: A Beginner’s Guide to Navigating the Digital Frontier Read More »

Chat with us